{"text_format":"1","workbook":"xlsx","n_sheets":5,"sheets":["Creacion  Activo","Alta Activo","Traspaso","Baja","Tabla de datos"],"not_rendered":{"charts":0,"images":1,"macros":0,"external_links":0,"defined_names":50,"comments":0,"pivot_tables":0},"unopened":[],"bounds":{"document_bytes":16777216,"sheet_cells":100000,"rows_first":2000,"rows_last":500,"rows_between":2000,"halvings":0,"cell_chars":16384,"cell_head_chars":4096},"cells_cut":0,"cells_raw":0,"read":"whole","date_system":"1900"}

{"sheet":"Creacion  Activo","index":0,"n_rows":40,"n_cols":10,"rows_kept":40,"cut":false,"hidden":false,"merged":[[31,3,31,4],[37,2,37,3],[37,8,37,9],[37,5,37,6],[25,1,25,10],[22,5,22,6],[18,1,21,10],[23,1,23,3],[23,6,23,7],[23,8,23,10],[2,9,2,10],[1,1,2,7],[4,1,4,10],[16,1,16,10],[7,7,7,8],[8,7,8,8],[9,7,9,8],[7,3,7,4],[8,3,8,4],[9,3,9,4],[11,3,11,4],[12,3,12,4]]}
[]
[null,"                                                                                                FICHA CREACION DE ACTIVO"]
[null,null,null,null,null,null,null,null,"Fecha ",{"$f":"+TODAY()","v":"2024-01-29"}]
[]
[null,"DATOS DEL SOLICITANTE"]
[]
[]
[null,null,"Area Solicitante",null,null,null,"CECO",{"$f":"+VLOOKUP(D9,'Tabla de datos'!J15:K51,2,0)","v":{"$error":"#N/A"}}]
[null,null,"Departamento",null,null,null,"CUENTA MAYOR"]
[null,null,"Solicitado",null,null,null,"PRESUPUESTO","NO"]
[]
[null,null,"Clasificacion",null,null,null,"Presupuesto Asignado"]
[null,null,"Vida Util",null,null,null,"EL ACTIVO se compone de varias compras"]
[]
[]
[]
[null,"DESCRIPCION DEL ACTIVO/ DETALLE DEL USO DEL NUEVO ACTIVO"]
[]
[]
[]
[]
[]
[]
[null,null,null,null,null,null,"(CLP)"]
[]
[null,"AUTORIZACIONES"]
[]
[]
[]
[]
[null,null,null,"Revisado por:","Juan Carlos Astete",null,"Revisado por:",{"$f":"+VLOOKUP(D9,'Tabla de datos'!A42:B73,2,0)","v":{"$error":"#N/A"}}]
[null,null,null,"REVISION DE ACTIVO FIJO",null,null,"RESPONSABLE DEL ACTIVO"]
[]
[]
[]
[]
[null,null,"Revisado por:",{"$f":"+VLOOKUP(D9,'Tabla de datos'!A42:C73,3,0)","v":{"$error":"#N/A"}},null,"Revisado por:","Comité",null,"Revisado por:","Comité"]
[null,null,"GERENTE SPONSOR",null,null,"COMITÉ DE INVERSIONES",null,null,"COMITÉ DE INVERSIONES"]
[]
[null,null,"N° PEP",null,null,"N° OBRA CURSO",null,null,"N° OBRA CURSO"]

{"sheet":"Alta Activo","index":1,"n_rows":38,"n_cols":9,"rows_kept":38,"cut":false,"hidden":true,"merged":[[22,1,38,5],[36,7,36,8],[6,7,6,9],[7,7,7,9],[8,7,8,9],[10,3,10,9],[12,7,12,9],[37,7,38,8],[13,7,13,9],[13,3,13,4],[21,5,21,6],[8,3,8,4],[12,3,12,4],[15,1,15,9],[17,1,20,9],[1,4,2,6],[6,1,6,2],[7,1,7,2],[12,1,12,2],[13,1,13,2],[8,1,8,2],[10,1,10,2],[4,1,4,9],[6,3,6,4],[7,3,7,4]]}
[]
[null,null,null,null,"SOLICITUD DE ALTA DE ACTIVOS"]
[null,null,null,null,null,null,null,"Fecha ",{"$f":"+TODAY()","v":"2024-01-29"}]
[]
[null,"DATOS DEL SOLICITANTE"]
[]
[null,"Area Solicitante",null,"Operaciones",null,null,"Codigo Activo Fijo"]
[null,"Departamento",null,"Deposito ",null,null,"Codigo Obra en Curso"]
[null,"Solicitado",null,"Patricio Mesina",null,null,"Monto a Activar"]
[]
[null,"Nombre del Activo"]
[]
[null," Vida Util Tecnica",null,null,null,null,"CECO",{"$f":"+VLOOKUP(D8,'Tabla de datos'!J15:K52,2,0)","v":10010301}]
[null,"Vida Util Tributaria",null,null,null,null,"Ubicación"]
[]
[null,"COMENTARIOS"]
[]
[]
[]
[]
[]
[]
[null,"FOTOGRAFIA"]
[]
[]
[]
[]
[]
[]
[]
[]
[]
[]
[]
[]
[]
[null,null,null,null,null,null,null,"Nombre y cargo"]
[null,null,null,null,null,null,null,"Firma Autorizadora"]

{"sheet":"Traspaso","index":2,"n_rows":38,"n_cols":9,"rows_kept":38,"cut":false,"hidden":true,"merged":[[7,1,7,2],[7,3,7,4],[7,7,7,9],[1,4,2,6],[4,1,4,9],[6,1,6,2],[6,3,6,4],[6,7,6,9],[21,5,21,6],[8,1,8,2],[8,3,8,4],[8,7,8,9],[10,1,10,2],[10,3,10,9],[12,1,12,2],[12,3,12,4],[12,7,12,9],[13,1,13,2],[13,3,13,4],[13,7,13,9],[15,1,15,9],[17,1,20,9],[37,6,38,8],[24,6,28,8],[29,6,30,8],[22,1,38,4],[32,6,36,8]]}
[]
[null,null,null,null,"SOLICITUD DE TRASPASO DE ACTIVOS"]
[null,null,null,null,null,null,null,"Fecha ",{"$f":"+TODAY()","v":"2024-01-29"}]
[]
[null,"DATOS DEL SOLICITANTE"]
[]
[null,"Area Solicitante",null,"Operaciones",null,null,"Area Nueva","Operaciones"]
[null,"Departamento",null,"Deposito ",null,null,"Departamento Nuevo","Contenedores_Nave"]
[null,"Solicitado",null,"Patricio Mesina",null,null,"Nuevo Responsable","Ivan Flores"]
[]
[null,"Nombre del Activo"]
[]
[null,"CECO Antiguo",null,{"$f":"+VLOOKUP(D8,'Tabla de datos'!J15:K52,2,0)","v":10010301},null,null,"CECO",{"$f":"+VLOOKUP(H8,'Tabla de datos'!J15:K52,2,0)","v":10010001}]
[null,"Ubicación Antigua",null,null,null,null,"Ubicación Nueva"]
[]
[null,"MOTIVOS DE TRASPASOS"]
[]
[]
[]
[]
[]
[]
[null,"FOTOGRAFIA"]
[]
[]
[]
[]
[]
[]
[null,null,null,null,null,null,"V°B° Area Actual Activo Fijo"]
[]
[]
[]
[]
[]
[]
[]
[null,null,null,null,null,null,"V°B° Area Nueva Activo Fijo"]

{"sheet":"Baja","index":3,"n_rows":38,"n_cols":9,"rows_kept":38,"cut":false,"hidden":true,"merged":[[12,1,12,2],[12,3,12,4],[12,7,12,9],[1,4,2,6],[4,1,4,9],[6,1,6,2],[6,3,6,4],[6,7,6,9],[7,1,7,2],[7,3,7,4],[7,7,7,9],[8,1,8,2],[8,3,8,4],[8,7,8,9],[10,1,10,2],[10,3,10,9],[22,1,38,5],[36,7,36,8],[37,7,38,8],[13,1,13,2],[13,3,13,4],[13,7,13,9],[15,1,15,9],[17,1,20,9],[21,5,21,6]]}
[]
[null,null,null,null,"SOLICITUD DE  BAJA DE ACTIVOS"]
[null,null,null,null,null,null,null,"Fecha ",{"$f":"+TODAY()","v":"2024-01-29"}]
[]
[null,"DATOS DEL SOLICITANTE"]
[]
[null,"Area Solicitante",null,"Administracion_Finanzas",null,null,"Codigo Activo Fijo",200606]
[null,"Departamento",null,"Remuneraciones",null,null,"Motivo de la Baja","Siniestro"]
[null,"Solicitado",null,"Patricio Manriquez",null,null,"Otro (Especificar)"]
[]
[null,"Nombre del Activo"]
[]
[null,"CECO ",null,{"$f":"+VLOOKUP(D8,'Tabla de datos'!J15:K52,2,0)","v":16030001},null,null,"Baja Con Enajenacion","NO"]
[null,"Ubicación "]
[]
[null,"COMENTARIOS"]
[]
[]
[]
[]
[]
[]
[null,"FOTOGRAFIA"]
[]
[]
[]
[]
[]
[]
[]
[]
[]
[]
[]
[]
[]
[]
[null,null,null,null,null,null,null,"Firma Autorizadora"]

{"sheet":"Tabla de datos","index":4,"n_rows":201,"n_cols":43,"rows_kept":201,"cut":false,"hidden":true,"merged":[]}
["Area","Gerencia","Responsable","Administracion_Finanzas","Subgerencia_Prevencion_y_Medio_Ambiente","Desarrollo_y_Excelencia_Operacional","Comercial","Ingenieria_y_Tecnologia","Planificacion","RRHH","Operaciones","Adquisiciones","Remuneraciones","Contabilidad_Facturacion","Tesoreria","Cobranza","Administracion","Equipos","TI","Desarrollo_Innovacion","Control_de_Gestion","Proyectos_Procesos","Control_Interno","Ingenieria","Depto_Comercial","Mantencion_Infraestructura","CLC","Gestion_de_Activos","Ingenieria_Ambiental","Prevencion","Seguridad","Calidad","Comunicación_Interna","Capacitacion","Calidad_de_Vida","CFS","Contenedores_Nave","Contenedores_Yard","Graneles_BB","Deposito ","Procesos","Medio_Ambiente","Proyectos"]
["Administracion_Finanzas","Gerencia General","Patricio Roman","Adquisiciones","Prevencion","Equipos","Depto_Comercial","Ingenieria_Industrial","Procesos","Capacitacion","CFS","Michael Muñoz","Luis Rodriguez","Juan Astete","Alejandro Gutierrez","Eduardo Zapata","Daniel Chamorro","Patricio Mesina","Roberto Sallorenzo","Roberto Sallorenzo","Miguel Rodriguez","Catalina Salas","Catalina Salas","Sebastian Meza","Javiera Montori","Rodrigo Fuentes","Rodrigo Pinto",null,"Manuel Flores","Manuel Flores","Juan Urrejola","Catalina Salas","Paula Sepulveda","Juan Monsalve","Maria Rojas","Benjamin Lobos","Tatiana Castillo","Tatiana Castillo","Jean Ruiz","Julio Cordonier","Catalina Salas","Manuel Flores","Rodrigo Fuentes"]
["Desarrollo_y_Excelencia_Operacional","RRHH","Isabel Besoain","Contabilidad_Facturacion","Medio_Ambiente","Gestion_de_Activos",null,"TI","Calidad","Calidad_de_Vida","Contenedores_Nave"]
["Comercial","Administracion","Daniel Chamorro","Tesoreria",null,"Proyectos",null,"Desarrollo_Innovacion","Control_Interno","Remuneraciones","Contenedores_Yard"]
["Ingenieria_y_Tecnologia","Comercial","Christian Prieto","Cobranza",null,"Mantencion_Infraestructura",null,null,"Capacitacion","Seguridad","Graneles_BB"]
["RRHH","Operaciones","Lukas Buckel","Administracion",null,null,null,null,"Calidad_de_Vida",null,"Deposito "]
["Operaciones","Desarrollo_y_Excelencia_Operacional","Cesar Aqueveque","Control_de_Gestion",null,null,null,null,null,null,"CLC"]
["Subgerencia_Prevencion_y_Medio_Ambiente","Subgerencia_Prevencion_y_Medio_Ambiente","Manuel Flores",null,null,null,null,null,null,null,"Seguridad"]
[null,null,null,null,null,null,null,null,null,null,"Medio_Ambiente"]
[null,null,null,null,null,null,null,null,null,null,"Prevencion"]
[]
[]
[]
[]
["Clasificacion","Vehiculos","Equipos_Computacionales","Herramientas_Menores","Equipos_Mayores","Mobilario","Aditamento_Maquinaria","Construccion_Oficinas","Cuenta Mayor","CECO","Adquisiciones","Asuntos Publicos","BB & B","Calidad de Vida","CFS","Contabilidad","Contenedores","Control Gestion","Control Interno","D&O","Deposito","Equipos","Gerencia de Administracion","Gerencia Comercial","Gerencia General","Gerencia Operaciones","Gerencia de Planificacion","Gerencia Logistica","Gerencia Calidad","Informatica","Ingenieria","Legales","Prevencion Riesgos","Proyectos","Remuneraciones","Tesoreria"]
["Vehiculos",7,4,3,7,3,3,null,null,"Adquisiciones",14020001,12010001,10020001,14010001,10010201,16010001,10010001,16050001,16060001,14040001,10010301,15020001,16020001,12000001,11000001,10000001,16000001,13000001,10000101,16040001,16090001,16070001,14030001,15010001,16030001,16080001]
["Equipos_Computacionales",null,null,null,null,null,null,null,null,"Asuntos Publicos",12010001]
["Herramientas_Menores",null,null,null,null,null,null,null,null,"Graneles_BB",10020001]
["Equipos_Mayores",null,null,null,null,null,null,null,null,"Calidad_de_Vida",14010001]
["Mobilario",null,null,null,null,null,null,null,null,"CFS",10010201]
["Aditamento_Maquinaria",null,null,null,null,null,null,null,null,"Contabilidad_Facturacion",16010001]
["Construccion_Oficinas",null,null,null,null,null,null,null,null,"Contenedores_Nave",10010001]
["Tecnologia",null,null,null,null,null,null,null,null,"Control_de_Gestion",16050001]
[null,null,null,null,null,null,null,null,null,"Control_Interno",16060001]
[null,null,null,null,null,null,null,null,null,"Capacitacion",14040001]
[null,null,null,null,null,null,null,null,null,"Deposito ",10010301]
[null,null,null,null,null,null,null,null,null,"Equipos",15020001]
[null,null,null,null,null,null,null,null,null,"Gerencia de Administracion",16020001]
[null,null,null,null,null,null,null,null,null,"Gerencia Comercial",12000001]
[null,null,null,null,null,null,null,null,null,"Gerencia General",11000001]
[null,null,null,null,null,null,null,null,null,"Gerencia Operaciones",10000001]
[null,null,null,null,null,null,null,null,null,"Gerencia de Planificacion",16000001]
[null,null,null,null,null,null,null,null,null,"Gerencia Logistica",13000001]
[null,null,null,null,null,null,null,null,null,"Gerencia Calidad",10000101]
[null,null,null,null,null,null,null,null,null,"TI",16040001]
[null,null,null,null,null,null,null,null,null,"Ingenieria",16090001]
[null,null,null,null,null,null,null,null,null,"Legales",16070001]
[null,null,null,null,null,null,null,null,null,"Prevencion",14030001]
[null,null,null,null,null,null,null,null,null,"Proyectos_Procesos",15010001]
[null,null,null,null,null,null,null,null,null,"Remuneraciones",16030001]
[null,null,null,null,null,null,null,null,null,"Tesoreria",16080001]
["Responsable","Nombre","Gerente",null,"Compone",null,null,null,null,"Contenedores_Yard",10010601]
["Adquisiciones","Michael Muñoz","Daniel Chamorro",null,"SI",null,null,null,null,"Administracion"]
["Remuneraciones","Luis Rodriguez","Isabel Besoain",null,"NO",null,null,null,null,"Depto_Comercial",12000001]
["Contabilidad_Facturacion","Juan Astete","Daniel Chamorro",null,null,null,null,null,null,"Mantencion_Infraestructura",13000001]
["Tesoreria","Alejandro Gutierrez","Daniel Chamorro",null,null,null,null,null,null,"CLC",10050001]
["Control_de_Contratos","Daniel Chamorro","Daniel Chamorro",null,null,null,null,null,null,"Servicios_ Generales",16130001]
["Administracion","Daniel Chamorro","Daniel Chamorro",null,null,null,null,null,null,"Ingenieria_Ambiental",14050001]
["Equipos","Patricio Mesina","Cesar Aqueveque",null,null,null,null,null,null,"Seguridad",13010001]
["TI","Roberto Sallorenzo ","Cesar Aqueveque",null,null,null,null,null,null,"Gestion_de_Activos",16130001]
["Desarrollo_Innovacion","Roberto Sallorenzo ","Cesar Aqueveque",null,null,null,null,null,null,"Comunicación_Interna"]
["Control_de_Gestion","Miguel Rodriguez","Daniel Chamorro"]
["Proyectos_Procesos","Catalina Salas","Cesar Aqueveque"]
["Control_Interno","Catalina Salas","Cesar Aqueveque"]
["Ingenieria","Sebastian Meza","Cesar Aqueveque"]
["Depto_Comercial","Javiera Motori","Christian Prieto"]
["Mantencion_Infraestructura","Rodrigo Fuentes","Cesar Aqueveque"]
["CLC","Rodrigo Pinto","Lukas Buckel"]
["Servicios_ Generales","Jorge Plaza","Cesar Aqueveque"]
["Ingenieria_Ambiental","Sebastian Vasquez","Cesar Aqueveque"]
["Prevencion","Manuel Flores","Lukas Buckel"]
["Seguridad","Juan Urrejola","Lukas Buckel"]
["Calidad","NN"]
["Comunicación_Interna","Daniela Toro","Isabel Besoain"]
["Capacitacion","Juan Monsalve","Isabel Besoain"]
["Calidad_de_Vida","Maria Rojas","Isabel Besoain"]
["CFS","Benjamin Lobos","Lukas Buckel"]
["Contenedores_Nave","Tatiana Castillo","Lukas Buckel"]
["Contenedores_Yard","Tatiana Castillo","Lukas Buckel"]
["Graneles_BB","Jean Ruiz","Lukas Buckel"]
["Deposito ","Julio Cordonier","Lukas Buckel"]
["Gestion_de_Activos","Cristian Leiva","Cesar Aqueveque"]
["Proyectos","Rodrigo Fuentes","Cesar Aqueveque"]
[]
[]
["Nº","Clase de Activos"]
[1000,"Terrenos en uso"]
[1100,"Terrenos mantenidos como inversión"]
[1200,"Edificios y otras obras"]
[1300,"Cierres perimetrales, áreas asfaltadas, áreas de a"]
[1400,"Caminos y vías ferreas"]
[1500,"Bodegas"]
[1600,"Muelles"]
[1700,"Maquinarias"]
[1800,"Equipos Mayores"]
[1900,"Equipos menores, Herramientas y Otros"]
[2000,"Equipos computacionales"]
[2100,"Vehículos"]
[2200,"Otras Instalaciones"]
[2300,"Activos en leasing"]
[2400,"Muebles y útiles"]
[2500,"Existencias de repuestos"]
[2600,"Otros activos fijos no clasificados"]
[2700,"Activos fijos en tránsito"]
[2800,"Obras en construcción"]
[2900,"Software"]
[3000,"Intangible Edificios y Otras Obras"]
[3100,"Intangible Cierres Perimetrales"]
[3200,"Intangible Caminos y Vías Férreas"]
[3300,"Intangible Muelles"]
[3400,"Intangible Equipos Mayores"]
[3500,"Intangible Otras Instalaciones"]
[3600,"Intangible Obras en Construcción"]
[3700,"Concesiones"]
[3800,"Otros Intangibles Software"]
[]
[]
["Nombre","Nº Cta",null,"Movimiento_Tierra","Obras_civiles","Estructuras"," Cubiertas","Inst_Eléctrica_Iluminación","Red_Incendio ","Aguas_Lluvias","Pavimento","Cerco_Perimetral","Ingeniería","Inspección ","Equipos_Compra","Montaje_Puesta_Marcha_Equipos","Varios_Proyectos "]
["Movimiento_Tierra",65180010,null,65180010,65180015,65180020,65180025,65180030,65180035,65180040,65180045,65180050,65180055,65180060,65180065,65180070,65180075]
["Obras_civiles",65180015]
["Estructuras",65180020]
[" Cubiertas",65180025]
["Inst_Eléctrica_Iluminación",65180030]
["Red_Incendio ",65180035]
["Aguas_Lluvias",65180040]
["Pavimento",65180045]
["Cerco_Perimetral",65180050]
["Ingeniería",65180055]
["Inspección ",65180060]
["Equipos_Compra",65180065]
["Montaje_Puesta_Marcha_Equipos",65180070]
["Varios_Proyectos ",65180075]
[]
[]
[]
[]
[]
[]
[]
[]
[]
[]
[]
[]
[]
[]
[]
[]
[]
[]
[]
[]
[]
[]
[]
["Clasifi","Nuevas_Inversiones","Reinversion","Iniciativas_de_Gastos"]
["Nuevas_Inversiones","TI","TI","TI"]
["Reinversion","Equipos","Equipos","Equipos"]
["Iniciativas_de_Gastos","Infraestructura","Infraestructura","Infraestructura"]
[null,"Activos","Activos","Activos"]
[null,"Utileria Portuaria","Utileria Portuaria","Utileria Portuaria"]
[]
[]
[]
[]
["Baja"]
["Obsolescencia"]
["Siniestro"]
["Hurto"]
["Otro"]
[]
[]
[]
[]
[]
["Nombre","Cargo"]
["Michael Muñoz","Jefe de Adquisiciones"]
["Patricio Manriquez","Jefe de Remuneraciones"]
["Juan Astete","Jefe de Contabilidad y Facturacion"]
["Alejandro Gutierrez","Encargado de Tesoreria"]
["Daniel Chamorro","Gerente de Administracion Y Finanzas"]
["Francisco Echeverria","Jefe de Equipos"]
["Patricio Rodriguez","Jefe TI"]
["Rodrigo Ruiz","Jefe de Desarrollo e Innovacion"]
["Michael Ortiz","Jefe de Control de Gestion"]
["Veronica Vera","Encargada de Procesos"]
["Lorena Santander","Jefe de Control Interno"]
["Cesar Aqueveque","Jefe de Ingenieria"]
["Florencia Prado"]
["Carlos Astorga"]
["Cristian Messenger"]
["Jorge Plaza"]
["Paola Lara","Encargada de Medioambiente"]
["Elena Villalobos","Jefe de Prevencion"]
["Patricio Valenzuela","OPIP"]
["NN"]
["Paulina Delgado","Encargada de Comunicaciones Internas"]
["Ana Esparza","Encargada de Capacitacion"]
["Margarita Jara","Encargada de Calidad de Vida"]
["Eric Hernandez","Jefe de CFS"]
["Ivan Flores","Jefe de Contenedores"]
["Rodrigo Pinto","Jefe de Yard"]
["Jean Ruiz","Jefe de Break Bulk"]
["Patricio Mesina","Jefe de Maestranza y Deposito"]
["Javier Anwandter","Gerente General"]
["Michelle Prater","Sub Gerente"]
["Rodrigo Schilling","Gerente Comercial"]
["Christian Prieto","Gerente de Operaciones"]
["Francisco Verscheure","Gerente de Logistica"]
["Alvaro Fernandez","Gerente de Seguridad y Calidad"]
["Claudio Rocuant","Gerente Desarrollo Transformacional"]